{"text_format":"1","workbook":"xlsx","n_sheets":5,"sheets":["Instructions","Playing Field","Data Store","Students","Category Summary"],"not_rendered":{"charts":0,"images":0,"macros":1,"external_links":0,"defined_names":1,"comments":0,"pivot_tables":1},"unopened":[],"bounds":{"document_bytes":16777216,"sheet_cells":100000,"rows_first":2000,"rows_last":500,"rows_between":2000,"halvings":0,"cell_chars":16384,"cell_head_chars":4096},"cells_cut":0,"cells_raw":0,"read":"whole","date_system":"1900"}

{"sheet":"Instructions","index":0,"n_rows":22,"n_cols":3,"rows_kept":22,"cut":false,"hidden":false,"merged":[]}
["Instructions"]
[]
["1. Choose \"Playing Field\" tab."]
[]
["2. Press one of the following commands:"]
[null,"CTRL + N","New student name"]
[null,"CTRL + A","All question information updated; display category only"]
[null,"CTRL + U","Unhide question (prompt)"]
[null,"CTRL + I","Info about the correct \"question\" (asked backward) to respond to the prompt"]
[null,"CTRL + H","Hide question info"]
[]
["3. Advanced commands (not needed in normal game play, but useful for debugging questions):"]
[null,"CTRL + K","Kick question index up by 1"]
[null,"CTRL + L","Lower question index by 1"]
[]
["4. To customize student names, go to the \"Students\" tab. Important: Insert or delete rows from"]
["     the middle of the list, which is an Excel named range called name_lookup. If you have 13"]
["     students, the numbers in column A should go from 1 through 13."]
[]
["5. To customize questions, modify columns A, B, D, E, and F in the \"Data Store\" tab."]
[]
["6. Stuck? Can't figure out how it works? Please contact Michael Hansen (mhansen@stalbansschool.org)."]

{"sheet":"Playing Field","index":1,"n_rows":9,"n_cols":6,"rows_kept":9,"cut":false,"hidden":false,"merged":[]}
[{"$f":"VLOOKUP(F2,name_lookup,2)","v":"Aardvark, Andy"},null,null,null,null,{"$f":"RANDBETWEEN(1,COUNT(Students!$A:$A))","v":9}]
[null,null,null,null,null,1]
[{"$f":"VLOOKUP(F8,'Data Store'!A1:G618,3)","v":"GRAB BAG"}]
[]
[{"$f":"VLOOKUP(F8,'Data Store'!A1:G618,4)","v":"Likely explanation if an effect is present but the test fails to find a P-value low enough to reject the null hypothesis"}]
[{"$f":"VLOOKUP(F8,'Data Store'!A1:G618,7)","v":"What is low power?"}]
[null,null,null,null,null,{"$f":"RANDBETWEEN(1,COUNTA('Data Store'!A:A)-1)","v":330}]
[null,null,null,null,null,191]
[null,null,null,null,null,{"$f":"F8+1","v":192}]

{"sheet":"Data Store","index":2,"n_rows":420,"n_cols":10,"rows_kept":420,"cut":false,"hidden":false,"merged":[]}
["QuestionID","Category","CategoryCaps","AnswerText","Question","Article","QuestionVerbose","Param1","Param2","Rand"]
[1,"\"Tails\" you lose",{"$f":"UPPER(B2)","v":"\"TAILS\" YOU LOSE"},"Area under the sampling distribution curve for values more extreme than the test statistic in either tail","2-tailed P-value","a",{"$f":"\"What is \"&F2&IF(LEN(F2)>0,\" \",\"\")&E2&\"?\"","v":"What is a 2-tailed P-value?"},null,null,{"$f":"RAND()","v":0.85687665101766775}]
[2,"MPQ stars","MPQ STARS","Situation in which the observed difference is too large to be plausibly explained by chance alone if the null hypothesis were true","statistical significance",null,{"$f":"\"What is \"&F3&IF(LEN(F3)>0,\" \",\"\")&E3&\"?\"","v":"What is statistical significance?"},null,null,0.91153242910735688]
[3,"All the world's a test","ALL THE WORLD'S A TEST","Model we use when comparing one mean against a benchmark, or the mean difference of matched pairs against 0","1-sample t",null,{"$f":"\"What is \"&F4&IF(LEN(F4)>0,\" \",\"\")&E4&\"?\"","v":"What is 1-sample t?"},null,null,0.51039085035537179]
[4,"It's hypothetical","IT'S HYPOTHETICAL","Hypothesis we can never prove, no matter how much evidence we gather","null hypothesis","the",{"$f":"\"What is \"&F5&IF(LEN(F5)>0,\" \",\"\")&E5&\"?\"","v":"What is the null hypothesis?"},null,null,0.16112062075807609]
[5,"It's hypothetical","IT'S HYPOTHETICAL","One decision we can make in a statistical test is to reject the null hypothesis; this is the other possible decision.","to fail to reject the null hypothesis",null,{"$f":"\"What is \"&F6&IF(LEN(F6)>0,\" \",\"\")&E6&\"?\"","v":"What is to fail to reject the null hypothesis?"},null,null,0.67138372225040455]
[6,"All the world's a test","ALL THE WORLD'S A TEST","The 3 test statistics that we care about in AP Statistics","t, z, and chi-square",null,{"$f":"\"What are \"&F7&IF(LEN(F7)>0,\" \",\"\")&E7&\"?\"","v":"What are t, z, and chi-square?"},null,null,0.83106745031455687]
[7,"Notation, notation, notation","NOTATION, NOTATION, NOTATION","Greek letter denoting a threshold for statistical significance (as measured by P-value)","α (alpha)",null,{"$f":"\"What is \"&F8&IF(LEN(F8)>0,\" \",\"\")&E8&\"?\"","v":"What is α (alpha)?"},null,null,0.3295754933399333]
[8,"All the world's a test","ALL THE WORLD'S A TEST","It's the most popular value for alpha, even though Ronald Fisher basically pulled it out of his ___ .","0.05",null,"What is 0.05?",null,null,0.74200394187513452]
[9,"All the world's a test","ALL THE WORLD'S A TEST","What we use if the stem of the AP question indicates we are looking for evidence that the true mean is less than some benchmark","1-tailed 1-sample t test","a","What is a 1-tailed 1-sample t test?",null,null,0.25272144846000744]
[10,"All the world's a test","ALL THE WORLD'S A TEST","What we use if the stem of the AP question indicates we are looking for evidence that the true mean differs from some benchmark","2-tailed 1-sample t test","a","What is a 2-tailed 1-sample t test?",null,null,0.87768769958247395]
[11,"The confidence game","THE CONFIDENCE GAME","Number between 0 and 1 (typically expressed as a percentage between 80% and 100%) indicating our degree of belief in the long-term reliability of the standard method for generating a C.I.","confidence level","a","What is a confidence level?",null,null,0.90403000897945596]
[12,"All the world's a test","ALL THE WORLD'S A TEST","A threshold value, typically denoted t* or z*, to indicate how many s.e. units we have to go out in the tail of the sampling distribution to achieve a desired P-value","critical value","a","What is a critical value?",null,null,0.97818760671857186]
[13,"\"Tails\" you lose","\"TAILS\" YOU LOSE","Main difference between z and t curves","heavier tails in the t distributions",null,"What is heavier tails in the t distributions?",null,null,0.35486646307768299]
[14,"MPQ stars","MPQ STARS","Conditional probability of obtaining a result as extreme as, or more extreme than, the test statistic seen, given that the null hypothesis is true","P-value","the","What is the P-value?",null,null,0.76789864078056069]
[15,"It's hypothetical","IT'S HYPOTHETICAL","What hypotheses must always refer to","unknown parameters",null,{"$f":"\"What are \"&F16&IF(LEN(F16)>0,\" \",\"\")&E16&\"?\"","v":"What are unknown parameters?"},null,null,0.55205452079232531]
[16,"MPQ stars","MPQ STARS","Most common type of regression","linear least-squares",null,{"$f":"\"What is \"&F17&IF(LEN(F17)>0,\" \",\"\")&E17&\"?\"","v":"What is linear least-squares?"},null,null,0.37162841319442586]
[17,"MPQ stars","MPQ STARS","A number computed from data, such as s, xbar, or phat","statistic","a",{"$f":"\"What is \"&F18&IF(LEN(F18)>0,\" \",\"\")&E18&\"?\"","v":"What is a statistic?"},null,null,0.69518521521618293]
[18,"MPQ stars","MPQ STARS","A number that describes a population, such as sigma, mu, or the true slope (beta) of a linear relationship","parameter","a",{"$f":"\"What is \"&F19&IF(LEN(F19)>0,\" \",\"\")&E19&\"?\"","v":"What is a parameter?"},null,null,0.82592202512585366]
[19,"It's hypothetical","IT'S HYPOTHETICAL","Adjective that almost always describes parameters","\"unknown\"",null,{"$f":"\"What is \"&F20&IF(LEN(F20)>0,\" \",\"\")&E20&\"?\"","v":"What is \"unknown\"?"},null,null,8.7179846822723062E-2]
[20,"MPQ stars","MPQ STARS","Alternate meaning that the word \"parameter\" has in fields other than statistics","adjustable constant","an",{"$f":"\"What is \"&F21&IF(LEN(F21)>0,\" \",\"\")&E21&\"?\"","v":"What is an adjustable constant?"},null,null,0.77847124449832017]
[21,"MPQ stars","MPQ STARS","The reason that we care about probability; the link between probability and inferential statistics","sampling distributions",null,{"$f":"\"What are \"&F22&IF(LEN(F22)>0,\" \",\"\")&E22&\"?\"","v":"What are sampling distributions?"},null,null,0.53710096238391525]
[22,"MPQ stars","MPQ STARS","LOLN","Law Of Large Numbers: xbar approaches mu (also acceptable: phat approaches p) as n grows large","the",{"$f":"\"What is \"&F23&IF(LEN(F23)>0,\" \",\"\")&E23&\"?\"","v":"What is the Law Of Large Numbers: xbar approaches mu (also acceptable: phat approaches p) as n grows large?"},null,null,0.88592685249240277]
[23,"MPQ stars","MPQ STARS","It's NOT bias, but this error invevitably occurs whenever a sample is used to make an inference about a population.","sampling error",null,"What is sampling error?",null,null,0.68736352815839519]
[24,"MPQ stars","MPQ STARS","Estimate of the likely upper bound for the sampling error, or half the width of a C.I.","m.o.e.","the","What is the m.o.e.?",null,null,0.33833609093202965]
[25,"MPQ stars","MPQ STARS","One-sentence summary of our course","\"We use statistics to estimate parameters\"",null,"What is \"We use statistics to estimate parameters\"?",null,null,0.73300838280656833]
[26,"MPQ stars","MPQ STARS","Disparaging term for data from a small sample, a convenience sample, or a person's own experience","\"anecdotal\"",null,"What is \"anecdotal\"?",null,null,7.508319849097711E-2]
[27,"MPQ stars","MPQ STARS","Of \"population size,\" \"sample size,\" or \"both,\" this determines the m.o.e. of an estimate in virtually all real-world situations.","sample size","the","What is the sample size?",null,null,0.18627734050909783]
[28,"MPQ stars","MPQ STARS","The reason that sample size determines m.o.e.","square root of n in the denominator of the s.e.","the","What is the square root of n in the denominator of the s.e.?",null,null,0.23937059946566985]
[29,"MPQ stars","MPQ STARS","What statistical significance is not the same as (though many people act as if it is)","practical significance",null,"What is practical significance?",null,null,0.97782754587493437]
[30,"MPQ stars","MPQ STARS","Of \"larger,\" \"smaller,\" or \"the same size,\" it's what n needs to be in Wyoming (population 600,000) to achieve the same accuracy as a poll in California (population 39.4 million).","\"the same size\"",null,"What is \"the same size\"?",null,null,9.6790517158566014E-2]
[31,"MPQ stars","MPQ STARS","The \"c\" word that correlation (or, more generally, association) does not prove","causation",null,"What is causation?",null,null,0.96072338755200237]
[32,"MPQ stars","MPQ STARS","The only way to prove causation","controlled experiment","a","What is a controlled experiment?",null,null,0.75180496978185907]
[33,"MPQ stars",{"$f":"UPPER(B34)","v":"MPQ STARS"},"Situation in which neither the experimental subjects nor the administrators interacting with them know which treatment is real and which is the placebo","double-blind experiment","a","What is a double-blind experiment?",null,null,{"$f":"RAND()","v":0.32998098221425065}]
[34,"MPQ stars","MPQ STARS","The two types of bias that double-blinding eliminates","placebo effect (for the subjects) and experimenter bias/conflict of interest (for the researchers)",null,{"$f":"\"What are \"&F35&IF(LEN(F35)>0,\" \",\"\")&E35&\"?\"","v":"What are placebo effect (for the subjects) and experimenter bias/conflict of interest (for the researchers)?"},null,null,0.2288601505736324]
[35,"MPQ stars","MPQ STARS","Several ways in which people lie with statistics","misleading graphs, biased samples, P-hacking, cherry-picking, Simpson's Paradox, and many others",null,{"$f":"\"What are \"&F36&IF(LEN(F36)>0,\" \",\"\")&E36&\"?\"","v":"What are misleading graphs, biased samples, P-hacking, cherry-picking, Simpson's Paradox, and many others?"},null,null,0.99913685130095742]
[36,"MPQ stars","MPQ STARS","Several questions we should always ask when encountering a statistic for the first time","\"Who says so?\" \"How do they know?\" \"Is something missing?\" \"Did someone change the subject?\" \"Does it have face validity?\"",null,{"$f":"E37","v":"\"Who says so?\" \"How do they know?\" \"Is something missing?\" \"Did someone change the subject?\" \"Does it have face validity?\""},null,null,0.43137555749899603]
[37,"MPQ stars","MPQ STARS",{"$f":"H38&\":\"&(I38-H38)&\" in favor, or \"&(I38-H38)&\":\"&H38&\" against\"","v":"5:11 in favor, or 11:5 against"},{"$f":"\"odds for an event whose probability is \"&H38&\"/\"&I38","v":"odds for an event whose probability is 5/16"},"the",{"$f":"\"What are \"&F38&IF(LEN(F38)>0,\" \",\"\")&E38&\"?\"","v":"What are the odds for an event whose probability is 5/16?"},{"$f":"RANDBETWEEN(4,28)","v":5},{"$f":"RANDBETWEEN(H38,H38+15)","v":16},0.57410035564709527]
[38,"The confidence game","THE CONFIDENCE GAME","All else being equal, a wider confidence interval has this, compared to a narrower confidence interval.","higher confidence level","a",{"$f":"\"What is \"&F39&IF(LEN(F39)>0,\" \",\"\")&E39&\"?\"","v":"What is a higher confidence level?"},null,null,0.99509282808229527]
[39,"The confidence game","THE CONFIDENCE GAME","Critical value (t* or z*) multiplied by standard error","m.o.e.","the","What is the m.o.e.?",null,null,0.76344083085703462]
[40,"The confidence game","THE CONFIDENCE GAME","Formula for m.o.e.","critical value (t* or z*) multiplied by standard error","the","What is the critical value (t* or z*) multiplied by standard error?",null,null,0.57423923592164905]
[41,"The confidence game","THE CONFIDENCE GAME",{"$f":"\"C.I. of \"&H42&\" plus or minus \"&I42&\", converted to interval format\"","v":"C.I. of 35 plus or minus 10, converted to interval format"},{"$f":"\"[\"&(H42-I42)&\", \"&(H42+I42)&\"]\"","v":"[25, 45]"},null,"What is [25, 45]?",{"$f":"RANDBETWEEN(3,77)","v":35},{"$f":"RANDBETWEEN(2,20)","v":10},0.77777858196875216]
[42,"The confidence game","THE CONFIDENCE GAME",{"$f":"\"C.I. of [\"&(H43-I43)&\", \"&(H43+I43)&\"] after being converted to the \"&CHAR(34)&\"point estimate plus or minus m.o.e.\"&CHAR(34)&\" format\"","v":"C.I. of [16, 50] after being converted to the \"point estimate plus or minus m.o.e.\" format"},{"$f":"H43&\" plus or minus \"&I43","v":"33 plus or minus 17"},null,"What is 33 plus or minus 17?",33,17,0.27598770677076823]
[43,"The confidence game","THE CONFIDENCE GAME",{"$f":"\"C.I. of \"&H44&\" plus or minus \"&I44&\", converted to interval format\"","v":"C.I. of 42 plus or minus 14, converted to interval format"},{"$f":"\"[\"&(H44-I44)&\", \"&(H44+I44)&\"]\"","v":"[28, 56]"},null,"What is [28, 56]?",42,14,0.3643695065404694]
[44,"The confidence game","THE CONFIDENCE GAME",{"$f":"\"C.I. of [\"&(H45-I45)&\", \"&(H45+I45)&\"] after being converted to the \"&CHAR(34)&\"point estimate plus or minus m.o.e.\"&CHAR(34)&\" format\"","v":"C.I. of [55, 91] after being converted to the \"point estimate plus or minus m.o.e.\" format"},{"$f":"H45&\" plus or minus \"&I45","v":"73 plus or minus 18"},null,"What is 73 plus or minus 18?",73,18,0.21321059732043479]
[45,"The confidence game","THE CONFIDENCE GAME",{"$f":"\"C.I. of \"&H46&\" plus or minus \"&I46&\", converted to interval format\"","v":"C.I. of 9 plus or minus 20, converted to interval format"},{"$f":"\"[\"&(H46-I46)&\", \"&(H46+I46)&\"]\"","v":"[-11, 29]"},null,"What is [-11, 29]?",9,20,0.85722912221649938]
[46,"The confidence game","THE CONFIDENCE GAME",{"$f":"\"C.I. of [\"&(H47-I47)&\", \"&(H47+I47)&\"] after being converted to the \"&CHAR(34)&\"point estimate plus or minus m.o.e.\"&CHAR(34)&\" format\"","v":"C.I. of [20, 46] after being converted to the \"point estimate plus or minus m.o.e.\" format"},{"$f":"H47&\" plus or minus \"&I47","v":"33 plus or minus 13"},null,"What is 33 plus or minus 13?",33,13,0.56109030230955437]
[47,"The confidence game","THE CONFIDENCE GAME",{"$f":"\"C.I. of \"&H48&\" plus or minus \"&I48&\", converted to interval format\"","v":"C.I. of 63 plus or minus 11, converted to interval format"},{"$f":"\"[\"&(H48-I48)&\", \"&(H48+I48)&\"]\"","v":"[52, 74]"},null,"What is [52, 74]?",63,11,0.73278306606463817]
[48,"The confidence game","THE CONFIDENCE GAME",{"$f":"\"C.I. of [\"&(H49-I49)&\", \"&(H49+I49)&\"] after being converted to the \"&CHAR(34)&\"point estimate plus or minus m.o.e.\"&CHAR(34)&\" format\"","v":"C.I. of [4, 24] after being converted to the \"point estimate plus or minus m.o.e.\" format"},{"$f":"H49&\" plus or minus \"&I49","v":"14 plus or minus 10"},null,"What is 14 plus or minus 10?",14,10,0.85599607606943495]
[49,"The confidence game","THE CONFIDENCE GAME","The \"confidence\" in \"confidence interval\" refers to the long-term success probability achieved by this.","method used to compute the C.I.","the","What is the method used to compute the C.I.?",null,null,0.11934793633444873]
[50,"Notation, notation, notation","NOTATION, NOTATION, NOTATION","Lower case s followed by a statistic-named subscript (such as xbar or phat)","standard error (s.e.)",null,"What is standard error (s.e.)?",null,null,0.66897553604818083]
[51,"Notation, notation, notation","NOTATION, NOTATION, NOTATION","s.e.","standard error: the estimated s.d. of the sampling distribution",null,"What is standard error: the estimated s.d. of the sampling distribution?",null,null,0.98572121574932448]
[52,"Notation, notation, notation","NOTATION, NOTATION, NOTATION","μ followed by a 0 subscript","hypothesized population mean (the value assumed by the null hypothesis)",null,"What is hypothesized population mean (the value assumed by the null hypothesis)?",null,null,0.57220622055081805]
[53,"Notation, notation, notation","NOTATION, NOTATION, NOTATION","Population mean assumed by the null hypothesis","μ followed by a 0 subscript",null,"What is μ followed by a 0 subscript?",null,null,0.16621637038448278]
[54,"Notation, notation, notation","NOTATION, NOTATION, NOTATION","Symbol that follows H sub 0 or H sub a when we are stating our hypotheses","colon (:)","a","What is a colon (:)?",null,null,2.7230034275563031E-2]
[55,"Notation, notation, notation","NOTATION, NOTATION, NOTATION","z*","z critical value (the z score that produces a desired 1-tailed P-value)","the","What is the z critical value (the z score that produces a desired 1-tailed P-value)?",null,null,0.60167571968442479]
[56,"Notation, notation, notation","NOTATION, NOTATION, NOTATION","t*","t critical value (the t score that produces a desired 1-tailed P-value)","the","What is the t critical value (the t score that produces a desired 1-tailed P-value)?",null,null,5.1912548155339855E-2]
[57,"Notation, notation, notation","NOTATION, NOTATION, NOTATION","The z score that produces a desired 1-tailed P-value","z*",null,"What is z*?",null,null,0.48493177569464008]
[58,"Notation, notation, notation","NOTATION, NOTATION, NOTATION","The t score that produces a desired 1-tailed P-value","t*",null,"What is t*?",null,null,0.38438722625706789]
[59,"PHA(S)TPC","PHA(S)TPC","What we always include when writing the \"Assumptions\" subheading","identification of the method used (1-sample t, 2-prop. z, etc.)",null,"What is identification of the method used (1-sample t, 2-prop. z, etc.)?",null,null,0.61044572955712173]
[60,"PHA(S)TPC","PHA(S)TPC","The number of lines we write in the H step","2",null,"What is 2?",null,null,0.89613207394287708]
[61,"PHA(S)TPC","PHA(S)TPC","What we depict (with the null hypothesis assumed true) in the optional step","sampling distribution of the statistic of interest","the","What is the sampling distribution of the statistic of interest?",null,null,0.58431280680933984]
[62,"PHA(S)TPC","PHA(S)TPC","What \"T\" stands for","test statistic (t, z, or chi-square)","the","What is the test statistic (t, z, or chi-square)?",null,null,0.59668381722879915]
[63,"PHA(S)TPC","PHA(S)TPC","What the first \"P\" stands for","\"definition of parameters\"",null,"What is \"definition of parameters\"?",null,null,0.51963814012379572]
[64,"PHA(S)TPC","PHA(S)TPC","What the second \"P\" stands for","P-value","the","What is the P-value?",null,null,0.27818626717133665]
[65,"PHA(S)TPC",{"$f":"UPPER(B66)","v":"PHA(S)TPC"},"What the \"C\" stands for","\"conclusion in context\"",null,"What is \"conclusion in context\"?",null,null,{"$f":"RAND()","v":0.28191937571613102}]
[66,"PHA(S)TPC","PHA(S)TPC","What the \"A\" stands for","\"identifying the test, stating assumptions, and checking assumptions\"",null,"What is \"identifying the test, stating assumptions, and checking assumptions\"?",null,null,0.44486189993069292]
[67,"It's hypothetical","IT'S HYPOTHETICAL","The hypothesis we hope to prove, so that our research paper will be likely to be published","alternative hypothesis (H sub a)","the","What is the alternative hypothesis (H sub a)?",null,null,0.28621166872879777]
[68,"All the world's a test","ALL THE WORLD'S A TEST","Unethical practice of accidentally \"losing\" a few data points or fudging some numbers so that statistical significance can be achieved","P-hacking",null,"What is P-hacking?",null,null,0.66028522679876167]
[69,"PHA(S)TPC","PHA(S)TPC","Words that should always begin the \"C\" step (for a statistical test)","\"Since P = ___ . . .\"",null,"What is \"Since P = ___ . . .\"?",null,null,0.15943535057587233]
[70,"PHA(S)TPC",{"$f":"UPPER(B71)","v":"PHA(S)TPC"},"Words that should always begin the \"C\" step (for a statistical test)","\"Since P = ___ . . .\"",null,{"$f":"\"What is \"&F71&IF(LEN(F71)>0,\" \",\"\")&E71&\"?\"","v":"What is \"Since P = ___ . . .\"?"},null,null,0.33729872889289092]
[71,"PHA(S)TPC","PHA(S)TPC","Words that should always begin the \"C\" step (for a statistical test)","\"Since P = ___ . . .\"",null,"What is \"Since P = ___ . . .\"?",null,null,0.22718911415790854]
[72,"PHA(S)TPC","PHA(S)TPC","Words that should always begin the \"C\" step (for a statistical test)","\"Since P = ___ . . .\"",null,"What is \"Since P = ___ . . .\"?",null,null,0.89463591397903619]
[73,"PHA(S)TPC","PHA(S)TPC","Words that should always begin the \"C\" step (for a statistical test)","\"Since P = ___ . . .\"",null,"What is \"Since P = ___ . . .\"?",null,null,0.40249708498237868]
[74,"PHA(S)TPC","PHA(S)TPC","Words that should always begin the \"C\" step (for a statistical test)","\"Since P = ___ . . .\"",null,"What is \"Since P = ___ . . .\"?",null,null,0.99285943007423538]
[75,"PHA(S)TPC","PHA(S)TPC","Words that should always begin the \"C\" step (for a statistical test)","\"Since P = ___ . . .\"",null,"What is \"Since P = ___ . . .\"?",null,null,6.8645006384545182E-2]
[76,"PHA(S)TPC","PHA(S)TPC","Words that should always begin the \"C\" step (for a statistical test)","\"Since P = ___ . . .\"",null,"What is \"Since P = ___ . . .\"?",null,null,0.33666731150036355]
[77,"PHA(S)TPC","PHA(S)TPC","Words that should always begin the \"C\" step (for a statistical test)","\"Since P = ___ . . .\"",null,"What is \"Since P = ___ . . .\"?",null,null,0.72093927746064734]
[78,"PHA(S)TPC","PHA(S)TPC","Words that should always begin the \"C\" step (for a statistical test)","\"Since P = ___ . . .\"",null,"What is \"Since P = ___ . . .\"?",null,null,0.72414535091239884]
[79,"PHA(S)TPC","PHA(S)TPC","Words that should always begin the \"C\" step (for a confidence interval)","\"We are __% confident that . . .\"",null,"What is \"We are __% confident that . . .\"?",null,null,0.38483077369271135]
{"$rows_left_out":341}
{"sheet":"Students","index":3,"n_rows":13,"n_cols":2,"rows_kept":13,"cut":false,"hidden":false,"merged":[]}
[1,"Aardvark, Andy"]
[2,"Buzzard, Bill"]
[3,"Crocodile, Chris"]
[4,"Dingo, Doug"]
[5,"Elephant, Earl"]
[6,"Flamingo, Florence"]
[7,"Gorilla, Geraldine"]
[8,"Hart, Hermione"]
[9,"Iodine, Inge"]
[10,"Jackrabbit, John"]
[11,"Kangaroo, Kate"]
[12,"Llama, Laura"]
[13,"Mongoose, Moira"]

{"sheet":"Category Summary","index":4,"n_rows":20,"n_cols":2,"rows_kept":20,"cut":false,"hidden":false,"merged":[]}
[]
[]
["Row Labels","Count of Category"]
["Calc, formula sheet, or memorize",50]
["Notation, notation, notation",41]
["All the world's a test",39]
["PHA(S)TPC",32]
["MPQ stars",29]
["Assumption gumption",27]
["Probability",23]
["The confidence game",22]
["It's hypothetical",21]
["Design of studies",19]
["\"Tails\" you lose",11]
["What the College Board wants",11]
["Statistic of interest",8]
["Moderately interesting history",6]
["Grab bag",37]
["(blank)"]
["Grand Total",376]